Tacito

Well-Known Member
Jul 15, 2017
1,029
478
and how can i get one more heart? im on one…
In a "legal" :) way if you are a good boy , read in depth this post
https://f95zone.to/threads/my-cute-roommate-v1-3-0-ev-beta-astaros3d.5405/post-843396

this is changed
"RP = Relationship point, you need 10 to get 1 heart, and 20 to get 2, and from that you can just collect the RP, but won't get any more hearts. "
from 1.21 the hearts displayed are limited to 3 when you give her red folder and 4 after submit documents to Dean and dream ...

or see here
https://f95zone.to/threads/my-cute-roommate-v1-3-0-ev-beta-astaros3d.5405/post-1734256
 
Last edited:

AkarkiJoe

New Member
Feb 2, 2019
12
13
Android version crashing at shop product pages. Is anyone know the solution for the problem?

Also... do you know guys how to find the game folder on android to add incest patch for instance?
 

Valex

New Member
Apr 27, 2017
1
0
^^ Same situation for me on Android...
Crashes at every choice in the store (on new game, not loading any previous saves).
And no way to find the "Game" folder to copy-paste the bug-fixes posted here or any other patch for that matter...

Any help would be appreciated.
 

rayminator

Active Member
Sep 26, 2018
125
32
Android version crashing at shop product pages. Is anyone know the solution for the problem?

Also... do you know guys how to find the game folder on android to add incest patch for instance?
has of right there is no bugfix for android

i have tried make one but renpy keep on say i need to download jdk i download it and put the path and it doesn't want to work

Code:
Ren'Py 7.2.2.491

I'm compiling a short test program, to see if you have a working JDK on your system.



Traceback (most recent call last):
  File "game/mobilebuild.rpy", line 197, in call
  File "/home/tom/ab/x64lucid-deps/install/lib/python2.7/subprocess.py", line 710, in __init__
  File "/home/tom/ab/x64lucid-deps/install/lib/python2.7/subprocess.py", line 958, in _execute_child
WindowsError: [Error 2] The system cannot find the file specified

I was unable to use javac to compile a test file. If you haven't installed the Java Development Kit yet, please download it from:

http://www.oracle.com/technetwork/java/javase/downloads/jdk8-downloads-2133151.html

The JDK is different from the JRE, so it's possible you have Java without having the JDK. Without a working JDK, I can't continue.
 

AkarkiJoe

New Member
Feb 2, 2019
12
13
However, I dont know what about you guys but the main girl in the beginning scared the sh*t out of me when I saw her eyes :D Shes like a dead walker from GoT :D
 

emotakoyaki

New Member
May 14, 2019
3
0
did any tried this out just want to make sure if it did work?

so if it didn't i can remove it
It is not working.
Code:
I'm sorry, but an uncaught exception occurred.

While running game code:
Exception: Could not find return label (u'E:\\MyGame\\Projekts\\My_cute_roommate_1.1.0ex+/game/store.rpy', 1550098926, 21817).

-- Full Traceback ------------------------------------------------------------

Full traceback:
  File "game/labels.rpyc", line 296, in script
  File "/private/var/folders/jd/81_x8zf5329b12tklmhqdm200000gn/T/AppTranslocation/1D62499F-1AE0-42D4-9453-03805780E0C9/d/My_cute_roommate.app/Contents/Resources/autorun/renpy/ast.py", line 1489, in execute
    next_node(renpy.game.context().lookup_return(pop=True))
  File "/private/var/folders/jd/81_x8zf5329b12tklmhqdm200000gn/T/AppTranslocation/1D62499F-1AE0-42D4-9453-03805780E0C9/d/My_cute_roommate.app/Contents/Resources/autorun/renpy/execution.py", line 680, in lookup_return
    raise Exception("Could not find return label {!r}.".format(self.return_stack[-1]))
Exception: Could not find return label (u'E:\\MyGame\\Projekts\\My_cute_roommate_1.1.0ex+/game/store.rpy', 1550098926, 21817).

Darwin-18.5.0-x86_64-i386-64bit
Ren'Py 7.2.2.491
 1.3.0.EX+
Thu May 16 18:30:51 2019
 

rayminator

Active Member
Sep 26, 2018
125
32
It is not working.
Code:
I'm sorry, but an uncaught exception occurred.

While running game code:
Exception: Could not find return label (u'E:\\MyGame\\Projekts\\My_cute_roommate_1.1.0ex+/game/store.rpy', 1550098926, 21817).

-- Full Traceback ------------------------------------------------------------

Full traceback:
  File "game/labels.rpyc", line 296, in script
  File "/private/var/folders/jd/81_x8zf5329b12tklmhqdm200000gn/T/AppTranslocation/1D62499F-1AE0-42D4-9453-03805780E0C9/d/My_cute_roommate.app/Contents/Resources/autorun/renpy/ast.py", line 1489, in execute
    next_node(renpy.game.context().lookup_return(pop=True))
  File "/private/var/folders/jd/81_x8zf5329b12tklmhqdm200000gn/T/AppTranslocation/1D62499F-1AE0-42D4-9453-03805780E0C9/d/My_cute_roommate.app/Contents/Resources/autorun/renpy/execution.py", line 680, in lookup_return
    raise Exception("Could not find return label {!r}.".format(self.return_stack[-1]))
Exception: Could not find return label (u'E:\\MyGame\\Projekts\\My_cute_roommate_1.1.0ex+/game/store.rpy', 1550098926, 21817).

Darwin-18.5.0-x86_64-i386-64bit
Ren'Py 7.2.2.491
1.3.0.EX+
Thu May 16 18:30:51 2019
ok thanks for letting me know
 

gestved

Well-Known Member
Aug 18, 2017
1,888
1,612
thank you for the bugfix, finally was able to play the new version, but I had to start all over again, if the game wasn't pretty good I would be very annoyed
 

rayminator

Active Member
Sep 26, 2018
125
32
well anyone know when the full version will be out , its a beta right ?
it should be about couple weeks from now maybe in 2 to 3 weeks he try to reproduce all errors.
blackmail barbara with the video it skips to the kitchen molesting scene I have try reproduce i can't reproduce it either
 
  • Like
Reactions: Alteni
3.50 star(s) 73 Votes